Rank: 44 based on 1187 downloads (last 30 days) and 11 files submitted
photo

MathWorks Embedded Coder Team

E-mail
Company/University
The MathWorks Inc

Personal Profile:
Professional Interests:

 

Watch this Author's files

 

Files Posted by MathWorks Embedded Coder Team View all
Updated   File Tags Downloads
(last 30 days)
Comments Rating
28 Mar 2014 Screenshot Embedded Coder Target for Arduino Custom target for Arduno and other processors Author: MathWorks Embedded Coder Team arduino, support package, pil, embedded coder, modeling, simulink 340 48
  • 4.45455
4.5 | 11 ratings
07 Mar 2014 Screenshot Embedded Coder Support Package for ARM Cortex-A Processors Generate code optimized for Cortex A processors. Author: MathWorks Embedded Coder Team arm 68 0
07 Mar 2014 Screenshot Embedded Coder Support Package for Texas Instruments C6000 DSPs Generate code optimized for C6000 DSP Author: MathWorks Embedded Coder Team c6000, ti 67 0
07 Mar 2014 Screenshot Embedded Coder Support Package for Texas Instruments C2000 Processors Embedded Coder Support Package installer file that works with Support package installer Author: MathWorks Embedded Coder Team aerospace, automotive, communications, control design, signal processing, embedded code 203 0
20 Jan 2014 Screenshot Embedded Coder Support Package for ARM Cortex-M Processors Embedded Coder Support Package installer file that works with Support package installer Author: MathWorks Embedded Coder Team aerospace, automotive, communications, control design 121 0
Comments and Ratings on MathWorks Embedded Coder Team's Files View all
Updated File Comment by Comments Rating
16 Apr 2014 Embedded Coder Target for Arduino Custom target for Arduno and other processors Author: MathWorks Embedded Coder Team Tomas

To Marta: Arduino Version 1.5.x is not supported, you have to use 1.0.5. The reason is that 1.5.x uses different folder structure and header files are on different paths.

16 Apr 2014 Embedded Coder Target for Arduino Custom target for Arduno and other processors Author: MathWorks Embedded Coder Team Tomas

Most of the new blocks are requiring to use C++ code generation. Please check under "Code Generation" -> "Language" -> "C++".

14 Apr 2014 Embedded Coder Target for Arduino Custom target for Arduno and other processors Author: MathWorks Embedded Coder Team EDUARDO

I recently downloaded the files and i am trying to use some of the examples included, but on many i get this type of error when trying to deploy on an Arduino Uno board.

Error: Simulink Coder Error in block: "myarduino_LCD_LED/LCD Shield", block type "S-Function": Formated LCD output block requires C++

I am currently using the newest version of MATLAB 2014a.

11 Apr 2014 Embedded Coder Target for Arduino Custom target for Arduno and other processors Author: MathWorks Embedded Coder Team Marta

I downloaded and did setup for Arduino Mega 2650. I run through README.pdf file. When I tried to run myarduino_blink.slx I got error message when doing build stage.
Please advise.
Below is the error message.

....
....
....

Compiling: myarduino_blink.cpp
Compiling: ert_main.cpp
In file included from myarduino_blink_data.cpp:16:
myarduino_blink.h:21:21: error: Arduino.h: No such file or directory
gmake: *** [myarduino_blink_data.o] Error 1
gmake: *** Waiting for unfinished jobs....

.....
.....
.....

gmake: *** [io_wrappers.o] Error 1
In file included from myarduino_blink.cpp:16:
myarduino_blink.h:21:21: error: Arduino.h: No such file or directory
myarduino_blink.cpp: In function 'void myarduino_blink_step()':
myarduino_blink.cpp:58: error: 'digitalWrite' was not declared in this scope
myarduino_blink.cpp: In function 'void myarduino_blink_initialize()':
myarduino_blink.cpp:87: error: 'OUTPUT' was not declared in this scope
myarduino_blink.cpp:87: error: 'pinMode' was not declared in this scope
gmake: *** [myarduino_blink.o] Error 1
In file included from ert_main.cpp:16:
myarduino_blink.h:21:21: error: Arduino.h: No such file or directory
ert_main.cpp:20: error: 'uint8_t' does not name a type
ert_main.cpp:21: error: 'uint8_t' does not name a type
ert_main.cpp: In function 'int main()':
ert_main.cpp:34: error: 'init' was not declared in this scope
ert_main.cpp:38: error: 'micros' was not declared in this scope
ert_main.cpp:48: error: 'uOverrunCounter' was not declared in this scope
gmake: *** [ert_main.o] Error 1
### Build procedure for model: 'myarduino_blink' aborted due to an error.

04 Apr 2014 Embedded Coder Support Package for Xilinx Zynq-7000 Platform Use Embedded Coder to implement algorithms on Zynq-7000 SoC ZC702 Evaluation Kit Author: MathWorks Embedded Coder Team H, bart

It appears that the "Getting Started with HW/SW Codesign Workflow for Xilinx Zynq Platform" example is broken in R2014a.

In particular the SW interface model generated as part of this demo – has no “Code Generation” options under “Configuration Parameters”.

Contact us