arduino due error when deploying

1 view (last 30 days)
abdolreza azizi
abdolreza azizi on 4 Aug 2017
Commented: abdolreza azizi on 6 Aug 2017
hi i want to deploy my simulink model in arduino due. i have 2017 matlab simulink and latest support package for arduino. i can deploy simulink model to arduino uno or arduino mega 2560 but it doesnt work with arduino due. the erro is :
### Starting build procedure for model: untitled Code Generation 1 Elapsed: 9 sec ### Generating code into build folder: F:\matlab\untitled_ert_rtw ### Invoking Target Language Compiler on untitled.rtw ### Using System Target File: C:\Program Files\MATLAB\R2017a\rtw\c\ert\ert.tlc ### Loading TLC function libraries ### Initial pass through model to cache user defined code . ### Caching model source code ### Writing header file untitled.h ### Writing header file untitled_types.h ### Writing source file untitled.c ### Writing header file rtwtypes.h . ### Writing header file untitled_private.h ### Writing source file untitled_data.c ### Writing header file rtmodel.h ### Writing source file ert_main.c ### TLC code generation complete. ### Evaluating PostCodeGenCommand specified in the model ### Using toolchain: Arduino ARM v1.6.7 | gmake (64-bit Windows) ### 'F:\matlab\untitled_ert_rtw\untitled.mk' is up to date ### Building 'untitled': "C:\PROGRA~1\MATLAB\R2017a\bin\win64\gmake" -f untitled.mk all C:/ProgramData/MATLAB/SupportPackages/R2017a/3P.instrset/arduinoide.instrset/idepkgs/packages/arduino/tools/arm-none-eabi-gcc/4.8.3-2014q1/bin/arm-none-eabi-g++ -std=gnu++11 -fno-threadsafe-statics -fno-rtti -fno-exceptions -Os -c -g -w -ffunction-sections -fdata-sections -nostdlib --param max-inline-insns-single=500 -Dprintf=iprintf -DARDUINO=10607 -MMD -MP -MF"MW_digitalio.dep" -MT"MW_digitalio.o" -MD -mcpu=cortex-m3 -DF_CPU=84000000L -DARDUINO_SAM_DUE -DARDUINO_ARCH_SAM -D__SAM3X8E__ -mthumb -DUSB_VID=0x2341 -DUSB_PID=0x003e -DUSBCON -DUSB_MANUFACTURER=\""Unknown\"" -DUSB_PRODUCT=\""Arduino Due\"" -D_RUNONTARGETHARDWARE_BUILD_ -D_ROTH_DUE_ -DMODEL=untitled -DNUMST=1 -DNCSTATES=0 -DHAVESTDIO -DTERMFCN=1 -DONESTEPFCN=1 -DMAT_FILE=0 -DMULTI_INSTANCE_CODE=0 -DINTEGER_CODE=0 -DMT=0 -DCLASSIC_INTERFACE=0 -DALLOCATIONFCN=0 -DTID01EQ=0 -DEXIT_FAILURE=1 -DEXTMODE_DISABLEPRINTF -DEXTMODE_DISABLETESTING -DEXTMODE_DISABLE_ARGS_PROCESSING=1 -DSTACK_SIZE=64 -D__MW_TARGET_USE_HARDWARE_RESOURCES_H__ -DRT -D_MW_ARDUINO_LOOP_=1 -DMW_ARDUINO_STEP_SIZE=100 -DMW_ARDUINO_MICROS -D_RTT_BAUDRATE_SERIAL0_=9600 -D_RTT_BAUDRATE_SERIAL1_=9600 -D_RTT_BAUDRATE_SERIAL2_=9600 -D_RTT_BAUDRATE_SERIAL3_=9600 -D_RTT_ANALOG_REF_=0 -DTERMFCN=1 -DONESTEPFCN=1 -DMAT_FILE=0 -DMULTI_INSTANCE_CODE=0 -DINTEGER_CODE=0 -DMT=0 -DCLASSIC_INTERFACE=0 -DALLOCATIONFCN=0 -DTID01EQ=0 -DEXIT_FAILURE=1 -DEXTMODE_DISABLEPRINTF -DEXTMODE_DISABLETESTING -DEXTMODE_DISABLE_ARGS_PROCESSING=1 -DSTACK_SIZE=64 -DRT -DMODEL=untitled -DNUMST=1 -DNCSTATES=0 -DHAVESTDIO -IF:/matlab -IC:/ProgramData/MATLAB/SupportPackages/R2017a/toolbox/target/supportpackages/arduinobase/include -IC:/PROGRA~1/MATLAB/R2017a/simulink/include/sf_runtime -IF:/matlab/untitled_ert_rtw -IC:/PROGRA~1/MATLAB/R2017a/extern/include -IC:/PROGRA~1/MATLAB/R2017a/simulink/include -IC:/PROGRA~1/MATLAB/R2017a/rtw/c/src -IC:/PROGRA~1/MATLAB/R2017a/rtw/c/src/ext_mode/common -IC:/PROGRA~1/MATLAB/R2017a/rtw/c/ert -IC:/ProgramData/MATLAB/SupportPackages/R2017a/3P.instrset/arduinoide.instrset/idepkgs/packages/arduino/hardware/sam/1.6.7/system/libsam -IC:/ProgramData/MATLAB/SupportPackages/R2017a/3P.instrset/arduinoide.instrset/idepkgs/packages/arduino/hardware/sam/1.6.7/system/CMSIS/CMSIS/Include -IC:/ProgramData/MATLAB/SupportPackages/R2017a/3P.instrset/arduinoide.instrset/idepkgs/packages/arduino/hardware/sam/1.6.7/system/CMSIS/Device/ATMEL -IC:/ProgramData/MATLAB/SupportPackages/R2017a/3P.instrset/arduinoide.instrset/idepkgs/packages/arduino/hardware/sam/1.6.7/cores/arduino -IC:/ProgramData/MATLAB/SupportPackages/R2017a/3P.instrset/arduinoide.instrset/idepkgs/packages/arduino/hardware/sam/1.6.7/cores/arduino/avr -IC:/ProgramData/MATLAB/SupportPackages/R2017a/3P.instrset/arduinoide.instrset/idepkgs/packages/arduino/hardware/sam/1.6.7/variants/arduino_due_x -IC:/ProgramData/MATLAB/SupportPackages/R2017a/toolbox/target/supportpackages/arduinotarget/include -IC:/ProgramData/MATLAB/SupportPackages/R2017a/toolbox/target/supportpackages/arduinotarget/scheduler/include -IC:/ProgramData/MATLAB/SupportPackages/R2017a/toolbox/target/shared/externalmode_daemon/include -o MW_digitalio.o C:/ProgramData/MATLAB/SupportPackages/R2017a/toolbox/target/supportpackages/arduinobase/src/MW_digitalio.cpp C:/ProgramData/MATLAB/SupportPackages/R2017a/toolbox/target/supportpackages/arduinobase/src/MW_digitalio.cpp:1:21: fatal error: Arduino.h: No such file or directory #include Arduino.h ^ compilation terminated. gmake: * [MW_digitalio.o] Error 1 ### Creating HTML report file untitled_codegen_rpt.html ### Build procedure for model: 'untitled' aborted due to an error. Error(s) encountered while building "untitled": ### Failed to generate all binary outputs.
  2 Comments

Sign in to comment.

Answers (0)

Community Treasure Hunt

Find the treasures in MATLAB Central and discover how the community can help you!

Start Hunting!